Jump to content

4 votes

How to build a Windows Qt Wallet For Any Coin Yourself From Source Code - Step by Step Instructions

Started By cinnamon_carter , Jul 10 2014 01:21 AM
windows QT build from source cryptocurrency mining cryptocoin cryptocoin development cryptocurrency development windows cryptocoin development altcoin creation guide altcoin wallet guide building windows QT from source

  • Please log in to reply
112 replies to this topic

#106

luke9511
  • luke9511
  • New Member
  • MEMBER
  • Pip
  • 6 posts
  • 1 topics
    • Time Online: 3h 10m 54s
  • Country:United States

Am having tremendous problems trying to compile QT.  Have tried all kinds of configure.bat options including both the ones in this thread and the ones in the "Compiling Bitcoin headless and bitcoin-qt on Windows" thread on BitcoinTalk.

 

Here's the error I'm getting.  It's the same with QT 5.2.1 and 5.3.2.  I'm using a 32-bit Windows 7 VM.

g++ -c -pipe -fno-keep-inline-dllexport -O2 -std=c++0x -fno-exceptions -frtti -W
all -Wextra -DUNICODE -DQT_NO_CAST_FROM_ASCII -DQT_NO_DIRECTWRITE -DQT_NO_EXCEPT
IONS -DQT_NO_DEBUG -DQT_STATICPLUGIN -DQT_PLUGIN -DQT_PLATFORMSUPPORT_LIB -DQT_G
UI_LIB -DQT_CORE_LIB -I. -I"." -I"..\..\..\3rdparty\wintab" -I"..\..\..\..\inclu
de" -I"..\..\..\..\include\QtPlatformSupport" -I"..\..\..\..\include\QtPlatformS
upport\5.3.2" -I"..\..\..\..\include\QtPlatformSupport\5.3.2\QtPlatformSupport"
-I"..\..\..\..\include\QtGui\5.3.2" -I"..\..\..\..\include\QtGui\5.3.2\QtGui" -I
"..\..\..\..\include\QtCore\5.3.2" -I"..\..\..\..\include\QtCore\5.3.2\QtCore" -
I"..\..\..\..\include\QtGui" -I"..\..\..\..\include\QtCore" -I".moc\release" -I"
C:\deps\libpng-1.5.16" -I"C:\deps\zlib-1.2.8" -I"C:\deps\openssl-1.0.1j\include"
 -I"..\..\..\..\mkspecs\win32-g++" -o .obj\release\qwindowscontext.o qwindowscon
text.cpp
qwindowscontext.cpp:80:22: fatal error: comdef.h: No such file or directory
 #  include <comdef.h>
                      ^
compilation terminated.
Makefile.Release:2347: recipe for target '.obj/release/qwindowscontext.o' failed

mingw32-make[5]: *** [.obj/release/qwindowscontext.o] Error 1
mingw32-make[5]: Leaving directory 'C:/Qt/5.3.2/src/plugins/platforms/windows'
Makefile:34: recipe for target 'release' failed
mingw32-make[4]: *** [release] Error 2
mingw32-make[4]: Leaving directory 'C:/Qt/5.3.2/src/plugins/platforms/windows'
Makefile:64: recipe for target 'sub-windows-make_first' failed
mingw32-make[3]: *** [sub-windows-make_first] Error 2
mingw32-make[3]: Leaving directory 'C:/Qt/5.3.2/src/plugins/platforms'
Makefile:121: recipe for target 'sub-platforms-make_first' failed
mingw32-make[2]: *** [sub-platforms-make_first] Error 2
mingw32-make[2]: Leaving directory 'C:/Qt/5.3.2/src/plugins'
Makefile:469: recipe for target 'sub-plugins-make_first' failed
mingw32-make[1]: *** [sub-plugins-make_first] Error 2
mingw32-make[1]: Leaving directory 'C:/Qt/5.3.2/src'
Makefile:41: recipe for target 'sub-src-make_first' failed
mingw32-make: *** [sub-src-make_first] Error 2

Seems to be part of the Microsoft Platform SDK but neither guide mentioned needing that.  http://stackoverflow.com/questions/157101/where-can-i-get-comdef-h

 

I tried getting it, but then I started getting different errors.

what wallet for what coin are you trying to compile? most coins need qt4 and very few need qt5


  • 0

Cryptocointalk.com doesn't endorse any ads. Warning: ads my be illegal or untrustworthy in your jurisdiction. Advertising Here.

#107

piggygreenmo
  • piggygreenmo
  • New Member
  • MEMBER
  • Pip
  • 7 posts
  • 1 topics
    • Time Online: 4h 11m 58s
  • Country:Japan

 

Am having tremendous problems trying to compile QT.  Have tried all kinds of configure.bat options including both the ones in this thread and the ones in the "Compiling Bitcoin headless and bitcoin-qt on Windows" thread on BitcoinTalk.

 

Here's the error I'm getting.  It's the same with QT 5.2.1 and 5.3.2.  I'm using a 32-bit Windows 7 VM.

g++ -c -pipe -fno-keep-inline-dllexport -O2 -std=c++0x -fno-exceptions -frtti -W
all -Wextra -DUNICODE -DQT_NO_CAST_FROM_ASCII -DQT_NO_DIRECTWRITE -DQT_NO_EXCEPT
IONS -DQT_NO_DEBUG -DQT_STATICPLUGIN -DQT_PLUGIN -DQT_PLATFORMSUPPORT_LIB -DQT_G
UI_LIB -DQT_CORE_LIB -I. -I"." -I"..\..\..\3rdparty\wintab" -I"..\..\..\..\inclu
de" -I"..\..\..\..\include\QtPlatformSupport" -I"..\..\..\..\include\QtPlatformS
upport\5.3.2" -I"..\..\..\..\include\QtPlatformSupport\5.3.2\QtPlatformSupport"
-I"..\..\..\..\include\QtGui\5.3.2" -I"..\..\..\..\include\QtGui\5.3.2\QtGui" -I
"..\..\..\..\include\QtCore\5.3.2" -I"..\..\..\..\include\QtCore\5.3.2\QtCore" -
I"..\..\..\..\include\QtGui" -I"..\..\..\..\include\QtCore" -I".moc\release" -I"
C:\deps\libpng-1.5.16" -I"C:\deps\zlib-1.2.8" -I"C:\deps\openssl-1.0.1j\include"
 -I"..\..\..\..\mkspecs\win32-g++" -o .obj\release\qwindowscontext.o qwindowscon
text.cpp
qwindowscontext.cpp:80:22: fatal error: comdef.h: No such file or directory
 #  include <comdef.h>
                      ^
compilation terminated.
Makefile.Release:2347: recipe for target '.obj/release/qwindowscontext.o' failed

mingw32-make[5]: *** [.obj/release/qwindowscontext.o] Error 1
mingw32-make[5]: Leaving directory 'C:/Qt/5.3.2/src/plugins/platforms/windows'
Makefile:34: recipe for target 'release' failed
mingw32-make[4]: *** [release] Error 2
mingw32-make[4]: Leaving directory 'C:/Qt/5.3.2/src/plugins/platforms/windows'
Makefile:64: recipe for target 'sub-windows-make_first' failed
mingw32-make[3]: *** [sub-windows-make_first] Error 2
mingw32-make[3]: Leaving directory 'C:/Qt/5.3.2/src/plugins/platforms'
Makefile:121: recipe for target 'sub-platforms-make_first' failed
mingw32-make[2]: *** [sub-platforms-make_first] Error 2
mingw32-make[2]: Leaving directory 'C:/Qt/5.3.2/src/plugins'
Makefile:469: recipe for target 'sub-plugins-make_first' failed
mingw32-make[1]: *** [sub-plugins-make_first] Error 2
mingw32-make[1]: Leaving directory 'C:/Qt/5.3.2/src'
Makefile:41: recipe for target 'sub-src-make_first' failed
mingw32-make: *** [sub-src-make_first] Error 2

Seems to be part of the Microsoft Platform SDK but neither guide mentioned needing that.  http://stackoverflow.com/questions/157101/where-can-i-get-comdef-h

 

I tried getting it, but then I started getting different errors.

what wallet for what coin are you trying to compile? most coins need qt4 and very few need qt5

 

Britcoin.  It's already using QT 5.2.1, according to the About QT box.

 

Now I'm trying with QT 5.5.1, and I've realised that the MS Windows SDK is obligatory these days: http://doc.qt.io/qt-5/windows-requirements.html

 

Problem is, QT's not using my INCLUDE and LIBS paths.  Configure.bat recites them correctly, but when I'm running mingw32-make, those files aren't included in the -I and -L arguments to g++, and so the compiler/linker can't find all the many files it needs.


  • 0

#108

piggygreenmo
  • piggygreenmo
  • New Member
  • MEMBER
  • Pip
  • 7 posts
  • 1 topics
    • Time Online: 4h 11m 58s
  • Country:Japan

So, I found the .h files QT needed to compile and put them in a QT folder.  Now I have a different error:

g++ -c -pipe -fno-keep-inline-dllexport -O2 -std=c++0x -fno-exceptions -frtti -W
all -Wextra -DUNICODE -DQT_NO_CAST_FROM_ASCII -DQT_NO_DIRECTWRITE -DQT_NO_EXCEPT
IONS -DQT_NO_DEBUG -DQT_STATICPLUGIN -DQT_PLUGIN -DQT_PLATFORMSUPPORT_LIB -DQT_G
UI_LIB -DQT_CORE_LIB -I. -I. -I..\..\..\3rdparty\wintab -I..\..\..\..\include -I
..\..\..\..\include\QtPlatformSupport -I..\..\..\..\include\QtPlatformSupport\5.
5.1 -I..\..\..\..\include\QtPlatformSupport\5.5.1\QtPlatformSupport -I..\..\..\.
.\include\QtGui\5.5.1 -I..\..\..\..\include\QtGui\5.5.1\QtGui -I..\..\..\..\incl
ude\QtGui -I..\..\..\..\include\QtCore\5.5.1 -I..\..\..\..\include\QtCore\5.5.1\
QtCore -I..\..\..\..\include\QtCore -I.moc\release -I..\..\..\..\mkspecs\win32-g
++  -o .obj\release\qwindowswindow.o qwindowswindow.cpp
In file included from ./objbase.h:163:0,
                 from ./ole2.h:17,
                 from ./wtypes.h:12,
                 from ./winscard.h:10,
                 from ./windows.h:97,
                 from ..\..\..\..\include/QtCore/../../src/corelib/global/qt_win
dows.h:63,
                 from ..\..\..\..\include/QtCore/qt_windows.h:1,
                 from qtwindows_additional.h:38,
                 from qwindowswindow.h:37,
                 from qwindowswindow.cpp:34:
./urlmon.h:301:0: warning: ignoring #pragma comment  [-Wunknown-pragmas]
 #pragma comment(lib,"uuid.lib")
 ^
In file included from c:\mingw\include\sys\types.h:49:0,
                 from c:\mingw\include\sys\stat.h:24,
                 from ..\..\..\..\mkspecs\win32-g++/qplatformdefs.h:53,
                 from ..\..\..\..\include\QtCore\5.5.1/QtCore/private/../../../.
./../src/corelib/thread/qthread_p.h:49,
                 from ..\..\..\..\include\QtCore\5.5.1/QtCore/private/qthread_p.
h:1,
                 from ..\..\..\..\include\QtGui\5.5.1\QtGui/private/../../../../
../src/gui/kernel/qguiapplication_p.h:53,
                 from ..\..\..\..\include\QtGui\5.5.1\QtGui/private/qguiapplicat
ion_p.h:1,
                 from qwindowswindow.cpp:53:
c:\mingw\include\parts\time.h:64:20: error: conflicting declaration 'typedef int
 __time32_t'
    typedef __int32 __time32_t; /* unambiguous 32-bit time_t */
                    ^
In file included from ./crtdefs.h:10:0,
                 from ./stddef.h:7,
                 from c:\mingw\lib\gcc\mingw32\4.8.1\include\c++\cstddef:42,
                 from ..\..\..\..\include/QtCore/../../src/corelib/global/qgloba
l.h:39,
                 from ..\..\..\..\include/QtCore/qglobal.h:1,
                 from ..\..\..\..\include/QtCore/QtGlobal:1,
                 from qtwindows_additional.h:37,
                 from qwindowswindow.h:37,
                 from qwindowswindow.cpp:34:
./_mingw.h:468:14: error: '__time32_t' has a previous declaration as 'typedef lo
ng int __time32_t'
 typedef long __time32_t;
              ^
In file included from c:\mingw\include\sys\stat.h:24:0,
                 from ..\..\..\..\mkspecs\win32-g++/qplatformdefs.h:53,
                 from ..\..\..\..\include\QtCore\5.5.1/QtCore/private/../../../.
./../src/corelib/thread/qthread_p.h:49,
                 from ..\..\..\..\include\QtCore\5.5.1/QtCore/private/qthread_p.
h:1,
                 from ..\..\..\..\include\QtGui\5.5.1\QtGui/private/../../../../
../src/gui/kernel/qguiapplication_p.h:53,
                 from ..\..\..\..\include\QtGui\5.5.1\QtGui/private/qguiapplicat
ion_p.h:1,
                 from qwindowswindow.cpp:53:
c:\mingw\include\sys\types.h:78:15: error: conflicting declaration 'typedef shor
t int _ino_t'
 typedef short _ino_t;
               ^
In file included from c:\mingw\lib\gcc\mingw32\4.8.1\include\c++\cwchar:44:0,
                 from c:\mingw\lib\gcc\mingw32\4.8.1\include\c++\bits\postypes.h
:40,
                 from c:\mingw\lib\gcc\mingw32\4.8.1\include\c++\bits\char_trait
s.h:40,
                 from c:\mingw\lib\gcc\mingw32\4.8.1\include\c++\string:40,
                 from c:\mingw\lib\gcc\mingw32\4.8.1\include\c++\random:41,
                 from c:\mingw\lib\gcc\mingw32\4.8.1\include\c++\bits\stl_algo.h
:65,
                 from c:\mingw\lib\gcc\mingw32\4.8.1\include\c++\algorithm:62,
                 from ..\..\..\..\include/QtCore/../../src/corelib/global/qgloba
l.h:85,
                 from ..\..\..\..\include/QtCore/qglobal.h:1,
                 from ..\..\..\..\include/QtCore/QtGlobal:1,
                 from qtwindows_additional.h:37,
                 from qwindowswindow.h:37,
                 from qwindowswindow.cpp:34:
./wchar.h:365:26: error: '_ino_t' has a previous declaration as 'typedef short u
nsigned int _ino_t'
   typedef unsigned short _ino_t;
                          ^
Makefile.Release:2643: recipe for target '.obj/release/qwindowswindow.o' failed
mingw32-make[5]: *** [.obj/release/qwindowswindow.o] Error 1
mingw32-make[5]: Leaving directory 'C:/Qt/551/src/plugins/platforms/windows'
Makefile:34: recipe for target 'release' failed
mingw32-make[4]: *** [release] Error 2
mingw32-make[4]: Leaving directory 'C:/Qt/551/src/plugins/platforms/windows'
Makefile:64: recipe for target 'sub-windows-make_first' failed
mingw32-make[3]: *** [sub-windows-make_first] Error 2
mingw32-make[3]: Leaving directory 'C:/Qt/551/src/plugins/platforms'
Makefile:121: recipe for target 'sub-platforms-make_first' failed
mingw32-make[2]: *** [sub-platforms-make_first] Error 2
mingw32-make[2]: Leaving directory 'C:/Qt/551/src/plugins'
Makefile:553: recipe for target 'sub-plugins-make_first' failed
mingw32-make[1]: *** [sub-plugins-make_first] Error 2
mingw32-make[1]: Leaving directory 'C:/Qt/551/src'
Makefile:41: recipe for target 'sub-src-make_first' failed
mingw32-make: *** [sub-src-make_first] Error 2

  • 0

#109

Bitcoindelivery
  • Bitcoindelivery
  • Newbie
  • MEMBER
  • Pip
  • 1 posts
  • 0 topics
    • Time Online: 2h 44m 22s

Hello all, first post on the forum for me!

First of all want to say BIG THANKS to cinnamon_carter for the very helpful guide.

I was stuck for 2 days on Shak3zula one figuring how to setup a Win7 system for a clean build....now i followed this one and looks like my Photon-test-wallet is compiling succesfull (at least for the first time)....

On Linux i was able to build from scratch, on Windows i had very big trouble: on my laptop i'm still not able to move forward on OpenSSL instead on Win7 worked fine

On Win i got some errors (that i have workarounded/bipassed) but i'll back writing later of that.....

For the moment i will wait the end of compiling...finger crossed!

 

At the end, the compile process failed due to an error on boost that i was not able to figure out.

I will retry today with another clean compile, reporting my steps


Edited by Bitcoindelivery, 21 February 2016 - 06:07 AM.

  • 0

#110

EuroLine
  • EuroLine
  • New Member
  • MEMBER
  • Pip
  • 2 posts
  • 0 topics
    • Time Online: 25m 44s
  • Country:Russian Federation

Why i'm getting tihs error?
 

 

./build\walletdb.o: In function `ZN5boost10filesystem9copy_fileERKNS0_4pathES3_NS0_11copy_optionE':

C:\build-sscoin-4_8-Debug/../deps/boost_1_53_0/boost/filesystem/operations.hpp:381: undefined reference to `boost::filesystem::detail::copy_file(boost::filesystem::path const&, boost::filesystem::path const&, boost::filesystem::copy_option, boost::system::error_code*)'

C:\SSCoin\src\leveldb\libleveldb.a(write_batch.o):write_batch.cc:(.text+0x1cd): undefined reference to `_Unwind_Resume'

C:\SSCoin\src\leveldb\libleveldb.a(write_batch.o):write_batch.cc:(.eh_frame+0x12b): undefined reference to `__gxx_personality_v0'

C:\SSCoin\src\leveldb\libleveldb.a(cache.o):cache.cc:(.text+0x218): undefined reference to `_Unwind_Resume'

C:\SSCoin\src\leveldb\libleveldb.a(cache.o):cache.cc:(.text+0x26c): undefined reference to `_Unwind_Resume'

C:\SSCoin\src\leveldb\libleveldb.a(cache.o):cache.cc:(.text+0x2c5): undefined reference to `_Unwind_Resume'

C:\SSCoin\src\leveldb\libleveldb.a(cache.o):cache.cc:(.text+0x3d8): undefined reference to `_Unwind_Resume'

C:\SSCoin\src\leveldb\libleveldb.a(cache.o):cache.cc:(.text+0x42f): undefined reference to `_Unwind_Resume'

C:\SSCoin\src\leveldb\libleveldb.a(cache.o):cache.cc:(.text+0x82b): more undefined references to `_Unwind_Resume' follow

C:\SSCoin\src\leveldb\libleveldb.a(cache.o):cache.cc:(.eh_frame+0xd7): undefined reference to `__gxx_personality_v0'

C:\SSCoin\src\leveldb\libleveldb.a(env_win.o):env_win.cc:(.text+0x78): undefined reference to `_Unwind_Resume'

C:\SSCoin\src\leveldb\libleveldb.a(env_win.o):env_win.cc:(.text+0x4c3): undefined reference to `_Unwind_Resume'

C:\SSCoin\src\leveldb\libleveldb.a(env_win.o):env_win.cc:(.text+0x593): undefined reference to `_Unwind_Resume'

C:\SSCoin\src\leveldb\libleveldb.a(env_win.o):env_win.cc:(.text+0x663): undefined reference to `_Unwind_Resume'

C:\SSCoin\src\leveldb\libleveldb.a(env_win.o):env_win.cc:(.text+0x87d): undefined reference to `_Unwind_Resume'

C:\SSCoin\src\leveldb\libleveldb.a(env_win.o):env_win.cc:(.text+0xbdd): more undefined references to `_Unwind_Resume' follow

C:\SSCoin\src\leveldb\libleveldb.a(env_win.o):env_win.cc:(.eh_frame+0x6b): undefined reference to `__gxx_personality_v0'

C:\SSCoin\src\leveldb\libleveldb.a(env_win.o):env_win.cc:(.eh_frame$_ZNSt6vectorISsSaISsEE13_M_insert_auxEN9__gnu_cxx17__normal_iteratorIPSsS1_EERKSs+0x13): undefined reference to `__gxx_personality_v0'

C:\SSCoin\src\leveldb\libleveldb.a(db_impl.o):db_impl.cc:(.text+0xa1): undefined reference to `_Unwind_Resume'

C:\SSCoin\src\leveldb\libleveldb.a(db_impl.o):db_impl.cc:(.text+0xf5): undefined reference to `_Unwind_Resume'

C:\SSCoin\src\leveldb\libleveldb.a(db_impl.o):db_impl.cc:(.text+0x2fe): undefined reference to `_Unwind_Resume'

C:\SSCoin\src\leveldb\libleveldb.a(db_impl.o):db_impl.cc:(.text+0x53d): undefined reference to `_Unwind_Resume'

C:\SSCoin\src\leveldb\libleveldb.a(db_impl.o):db_impl.cc:(.text+0xa1e): undefined reference to `_Unwind_Resume'

C:\SSCoin\src\leveldb\libleveldb.a(db_impl.o):db_impl.cc:(.text+0xd34): more undefined references to `_Unwind_Resume' follow

C:\SSCoin\src\leveldb\libleveldb.a(db_impl.o):db_impl.cc:(.eh_frame+0x57): undefined reference to `__gxx_personality_v0'

C:\SSCoin\src\leveldb\libleveldb.a(db_impl.o):db_impl.cc:(.eh_frame$_ZStplIcSt11char_traitsIcESaIcEESbIT_T0_T1_ERKS6_S8_+0x13): undefined reference to `__gxx_personality_v0'

C:\SSCoin\src\leveldb\libleveldb.a(db_impl.o):db_impl.cc:(.eh_frame$_ZNSt6vectorISt4pairIiN7leveldb12FileMetaDataEESaIS3_EE13_M_insert_auxEN9__gnu_cxx17__normal_iteratorIPS3_S5_EERKS3_+0x13): undefined reference to `__gxx_personality_v0'

C:\SSCoin\src\leveldb\libleveldb.a(db_impl.o):db_impl.cc:(.eh_frame$_ZNSt6vectorIN7leveldb6DBImpl15CompactionState6OutputESaIS3_EE13_M_insert_auxEN9__gnu_cxx17__normal_iteratorIPS3_S5_EERKS3_+0x13): undefined reference to `__gxx_personality_v0'

C:\SSCoin\src\leveldb\libleveldb.a(db_impl.o):db_impl.cc:(.eh_frame$_ZNSt8_Rb_treeIyySt9_IdentityIyESt4lessIyESaIyEE7_M_copyEPKSt13_Rb_tree_nodeIyEPS7_+0x13): undefined reference to `__gxx_personality_v0'

C:\SSCoin\src\leveldb\libleveldb.a(status.o):status.cc:(.text+0x28a): undefined reference to `_Unwind_Resume'

C:\SSCoin\src\leveldb\libleveldb.a(status.o):status.cc:(.eh_frame+0xb3): undefined reference to `__gxx_personality_v0'

C:\SSCoin\src\leveldb\libleveldb.a(memtable.o):memtable.cc:(.text+0xcf): undefined reference to `_Unwind_Resume'

C:\SSCoin\src\leveldb\libleveldb.a(memtable.o):memtable.cc:(.text+0x14a): undefined reference to `_Unwind_Resume'

C:\SSCoin\src\leveldb\libleveldb.a(memtable.o):memtable.cc:(.text+0x24c): undefined reference to `_Unwind_Resume'

C:\SSCoin\src\leveldb\libleveldb.a(memtable.o):memtable.cc:(.text+0x400): undefined reference to `_Unwind_Resume'

C:\SSCoin\src\leveldb\libleveldb.a(memtable.o):memtable.cc:(.eh_frame+0x13): undefined reference to `__gxx_personality_v0'

C:\SSCoin\src\leveldb\libleveldb.a(port_win.o):port_win.cc:(.text+0x16a): undefined reference to `_Unwind_Resume'

C:\SSCoin\src\leveldb\libleveldb.a(port_win.o):port_win.cc:(.text+0x1b2): undefined reference to `_Unwind_Resume'

C:\SSCoin\src\leveldb\libleveldb.a(port_win.o):port_win.cc:(.eh_frame+0xcf): undefined reference to `__gxx_personality_v0'

C:\SSCoin\src\leveldb\libleveldb.a(env.o):env.cc:(.text+0x3ca): undefined reference to `_Unwind_Resume'

C:\SSCoin\src\leveldb\libleveldb.a(env.o):env.cc:(.text+0x76d): undefined reference to `_Unwind_Resume'

C:\SSCoin\src\leveldb\libleveldb.a(env.o):env.cc:(.eh_frame+0x83): undefined reference to `__gxx_personality_v0'

C:\SSCoin\src\leveldb\libleveldb.a(dbformat.o):dbformat.cc:(.text+0x29a): undefined reference to `_Unwind_Resume'

C:\SSCoin\src\leveldb\libleveldb.a(dbformat.o):dbformat.cc:(.text+0x3c9): undefined reference to `_Unwind_Resume'

C:\SSCoin\src\leveldb\libleveldb.a(dbformat.o):dbformat.cc:(.text+0x565): undefined reference to `_Unwind_Resume'

C:\SSCoin\src\leveldb\libleveldb.a(dbformat.o):dbformat.cc:(.text+0x705): undefined reference to `_Unwind_Resume'

C:\SSCoin\src\leveldb\libleveldb.a(dbformat.o):dbformat.cc:(.eh_frame+0x117): undefined reference to `__gxx_personality_v0'

C:\SSCoin\src\leveldb\libleveldb.a(log_reader.o):log_reader.cc:(.text+0x1ee): undefined reference to `_Unwind_Resume'

C:\SSCoin\src\leveldb\libleveldb.a(log_reader.o):log_reader.cc:(.text+0x28c): undefined reference to `_Unwind_Resume'

C:\SSCoin\src\leveldb\libleveldb.a(log_reader.o):log_reader.cc:(.text+0x50b): undefined reference to `_Unwind_Resume'

C:\SSCoin\src\leveldb\libleveldb.a(log_reader.o):log_reader.cc:(.eh_frame+0xf7): undefined reference to `__gxx_personality_v0'

C:\SSCoin\src\leveldb\libleveldb.a(version_set.o):version_set.cc:(.text+0x253): undefined reference to `_Unwind_Resume'

C:\SSCoin\src\leveldb\libleveldb.a(version_set.o):version_set.cc:(.text+0x65e): undefined reference to `_Unwind_Resume'

C:\SSCoin\src\leveldb\libleveldb.a(version_set.o):version_set.cc:(.text+0x6f6): undefined reference to `_Unwind_Resume'

C:\SSCoin\src\leveldb\libleveldb.a(version_set.o):version_set.cc:(.text+0xadb): undefined reference to `_Unwind_Resume'

C:\SSCoin\src\leveldb\libleveldb.a(version_set.o):version_set.cc:(.text+0xc68): undefined reference to `_Unwind_Resume'

C:\SSCoin\src\leveldb\libleveldb.a(version_set.o):version_set.cc:(.text+0xed6): more undefined references to `_Unwind_Resume' follow

C:\SSCoin\src\leveldb\libleveldb.a(version_set.o):version_set.cc:(.eh_frame+0x113): undefined reference to `__gxx_personality_v0'

C:\SSCoin\src\leveldb\libleveldb.a(version_set.o):version_set.cc:(.eh_frame$_ZN7leveldb7Version20LevelFileNumIteratorD1Ev+0x13): undefined reference to `__gxx_personality_v0'

C:\SSCoin\src\leveldb\libleveldb.a(version_set.o):version_set.cc:(.eh_frame$_ZN7leveldb7Version20LevelFileNumIteratorD0Ev+0x13): undefined reference to `__gxx_personality_v0'

C:\SSCoin\src\leveldb\libleveldb.a(version_set.o):version_set.cc:(.eh_frame$_ZN7leveldb10VersionSet7BuilderD1Ev+0x13): undefined reference to `__gxx_personality_v0'

C:\SSCoin\src\leveldb\libleveldb.a(version_set.o):version_set.cc:(.eh_frame$_ZNSt6vectorISt4pairIiN7leveldb11InternalKeyEESaIS3_EE13_M_insert_auxEN9__gnu_cxx17__normal_iteratorIPS3_S5_EERKS3_+0x13): undefined reference to `__gxx_personality_v0'

C:\SSCoin\src\leveldb\libleveldb.a(logging.o):logging.cc:(.text+0x17f): undefined reference to `_Unwind_Resume'

C:\SSCoin\src\leveldb\libleveldb.a(logging.o):logging.cc:(.text+0x1d7): undefined reference to `_Unwind_Resume'

C:\SSCoin\src\leveldb\libleveldb.a(logging.o):logging.cc:(.eh_frame+0xcf): undefined reference to `__gxx_personality_v0'

C:\SSCoin\src\leveldb\libleveldb.a(filename.o):filename.cc:(.text+0xfb): undefined reference to `_Unwind_Resume'

C:\SSCoin\src\leveldb\libleveldb.a(filename.o):filename.cc:(.text+0x237): undefined reference to `_Unwind_Resume'

C:\SSCoin\src\leveldb\libleveldb.a(filename.o):filename.cc:(.text+0x29c): undefined reference to `_Unwind_Resume'

C:\SSCoin\src\leveldb\libleveldb.a(filename.o):filename.cc:(.text+0x2fc): undefined reference to `_Unwind_Resume'

C:\SSCoin\src\leveldb\libleveldb.a(filename.o):filename.cc:(.text+0x39c): undefined reference to `_Unwind_Resume'

C:\SSCoin\src\leveldb\libleveldb.a(filename.o):filename.cc:(.text+0x3fc): more undefined references to `_Unwind_Resume' follow

C:\SSCoin\src\leveldb\libleveldb.a(filename.o):filename.cc:(.eh_frame+0x5b): undefined reference to `__gxx_personality_v0'

C:\SSCoin\src\leveldb\libleveldb.a(table_builder.o):table_builder.cc:(.text+0x261): undefined reference to `_Unwind_Resume'

C:\SSCoin\src\leveldb\libleveldb.a(table_builder.o):table_builder.cc:(.text+0x88d): undefined reference to `_Unwind_Resume'

C:\SSCoin\src\leveldb\libleveldb.a(table_builder.o):table_builder.cc:(.text+0xa5c): undefined reference to `_Unwind_Resume'

C:\SSCoin\src\leveldb\libleveldb.a(table_builder.o):table_builder.cc:(.text+0xc0b): undefined reference to `_Unwind_Resume'

C:\SSCoin\src\leveldb\libleveldb.a(table_builder.o):table_builder.cc:(.text+0x123b): undefined reference to `_Unwind_Resume'

C:\SSCoin\src\leveldb\libleveldb.a(table_builder.o):table_builder.cc:(.text+0x126e): more undefined references to `_Unwind_Resume' follow

C:\SSCoin\src\leveldb\libleveldb.a(table_builder.o):table_builder.cc:(.eh_frame+0x5b): undefined reference to `__gxx_personality_v0'

C:\SSCoin\src\leveldb\libleveldb.a(table_cache.o):table_cache.cc:(.text+0xfe): undefined reference to `_Unwind_Resume'

C:\SSCoin\src\leveldb\libleveldb.a(table_cache.o):table_cache.cc:(.text+0x19d): undefined reference to `_Unwind_Resume'

C:\SSCoin\src\leveldb\libleveldb.a(table_cache.o):table_cache.cc:(.text+0x417): undefined reference to `_Unwind_Resume'

C:\SSCoin\src\leveldb\libleveldb.a(table_cache.o):table_cache.cc:(.text+0x529): undefined reference to `_Unwind_Resume'

C:\SSCoin\src\leveldb\libleveldb.a(table_cache.o):table_cache.cc:(.text+0x638): undefined reference to `_Unwind_Resume'

C:\SSCoin\src\leveldb\libleveldb.a(table_cache.o):table_cache.cc:(.eh_frame+0xa7): undefined reference to `__gxx_personality_v0'

C:\SSCoin\src\leveldb\libleveldb.a(log_writer.o):log_writer.cc:(.text+0x1ed): undefined reference to `_Unwind_Resume'

C:\SSCoin\src\leveldb\libleveldb.a(log_writer.o):log_writer.cc:(.text+0x356): undefined reference to `_Unwind_Resume'

C:\SSCoin\src\leveldb\libleveldb.a(log_writer.o):log_writer.cc:(.eh_frame+0x73): undefined reference to `__gxx_personality_v0'

C:\SSCoin\src\leveldb\libleveldb.a(version_edit.o):version_edit.cc:(.text+0x920): undefined reference to `_Unwind_Resume'

C:\SSCoin\src\leveldb\libleveldb.a(version_edit.o):version_edit.cc:(.text+0x1402): undefined reference to `_Unwind_Resume'

C:\SSCoin\src\leveldb\libleveldb.a(version_edit.o):version_edit.cc:(.eh_frame+0xf7): undefined reference to `__gxx_personality_v0'

C:\SSCoin\src\leveldb\libleveldb.a(builder.o):builder.cc:(.text+0x4ff): undefined reference to `_Unwind_Resume'

C:\SSCoin\src\leveldb\libleveldb.a(builder.o):builder.cc:(.eh_frame+0x13): undefined reference to `__gxx_personality_v0'

C:\SSCoin\src\leveldb\libleveldb.a(merger.o):merger.cc:(.text+0xb58): undefined reference to `_Unwind_Resume'

C:\SSCoin\src\leveldb\libleveldb.a(merger.o):merger.cc:(.text+0x1040): undefined reference to `_Unwind_Resume'

C:\SSCoin\src\leveldb\libleveldb.a(merger.o):merger.cc:(.text+0x1370): undefined reference to `_Unwind_Resume'

C:\SSCoin\src\leveldb\libleveldb.a(merger.o):merger.cc:(.text+0x5a65): undefined reference to `_Unwind_Resume'

C:\SSCoin\src\leveldb\libleveldb.a(merger.o):merger.cc:(.eh_frame+0x143): undefined reference to `__gxx_personality_v0'

C:\SSCoin\src\leveldb\libleveldb.a(iterator.o):iterator.cc:(.text+0x289): undefined reference to `_Unwind_Resume'

C:\SSCoin\src\leveldb\libleveldb.a(iterator.o):iterator.cc:(.eh_frame+0x1c7): undefined reference to `__gxx_personality_v0'

C:\SSCoin\src\leveldb\libleveldb.a(db_iter.o):db_iter.cc:(.text+0x41a): undefined reference to `_Unwind_Resume'

C:\SSCoin\src\leveldb\libleveldb.a(db_iter.o):db_iter.cc:(.text+0x71e): undefined reference to `_Unwind_Resume'

C:\SSCoin\src\leveldb\libleveldb.a(db_iter.o):db_iter.cc:(.text+0x84c): undefined reference to `_Unwind_Resume'

C:\SSCoin\src\leveldb\libleveldb.a(db_iter.o):db_iter.cc:(.text+0xd9a): undefined reference to `_Unwind_Resume'

C:\SSCoin\src\leveldb\libleveldb.a(db_iter.o):db_iter.cc:(.text+0x13de): undefined reference to `_Unwind_Resume'

C:\SSCoin\src\leveldb\libleveldb.a(db_iter.o):db_iter.cc:(.text+0x1737): more undefined references to `_Unwind_Resume' follow

C:\SSCoin\src\leveldb\libleveldb.a(db_iter.o):db_iter.cc:(.eh_frame+0xd7): undefined reference to `__gxx_personality_v0'

C:\SSCoin\src\leveldb\libleveldb.a(two_level_iterator.o):two_level_iterator.cc:(.text+0x114): undefined reference to `_Unwind_Resume'

C:\SSCoin\src\leveldb\libleveldb.a(two_level_iterator.o):two_level_iterator.cc:(.text+0x2f0): undefined reference to `_Unwind_Resume'

C:\SSCoin\src\leveldb\libleveldb.a(two_level_iterator.o):two_level_iterator.cc:(.text+0x1abe): undefined reference to `_Unwind_Resume'

C:\SSCoin\src\leveldb\libleveldb.a(two_level_iterator.o):two_level_iterator.cc:(.eh_frame+0x53): undefined reference to `__gxx_personality_v0'

C:\SSCoin\src\leveldb\libleveldb.a(table.o):table.cc:(.text+0x3a6): undefined reference to `_Unwind_Resume'

C:\SSCoin\src\leveldb\libleveldb.a(table.o):table.cc:(.text+0x4cb): undefined reference to `_Unwind_Resume'

C:\SSCoin\src\leveldb\libleveldb.a(table.o):table.cc:(.text+0x6a3): undefined reference to `_Unwind_Resume'

C:\SSCoin\src\leveldb\libleveldb.a(table.o):table.cc:(.text+0x6bb): undefined reference to `_Unwind_Resume'

C:\SSCoin\src\leveldb\libleveldb.a(table.o):table.cc:(.text+0x971): undefined reference to `_Unwind_Resume'

C:\SSCoin\src\leveldb\libleveldb.a(table.o):table.cc:(.text+0xb1d): more undefined references to `_Unwind_Resume' follow

C:\SSCoin\src\leveldb\libleveldb.a(table.o):table.cc:(.eh_frame+0xa3): undefined reference to `__gxx_personality_v0'

C:\SSCoin\src\leveldb\libleveldb.a(block_builder.o):block_builder.cc:(.text+0x2cb): undefined reference to `_Unwind_Resume'

C:\SSCoin\src\leveldb\libleveldb.a(block_builder.o):block_builder.cc:(.eh_frame+0x103): undefined reference to `__gxx_personality_v0'

C:\SSCoin\src\leveldb\libleveldb.a(format.o):format.cc:(.text+0x2a6): undefined reference to `_Unwind_Resume'

C:\SSCoin\src\leveldb\libleveldb.a(format.o):format.cc:(.text+0x592): undefined reference to `_Unwind_Resume'

C:\SSCoin\src\leveldb\libleveldb.a(format.o):format.cc:(.eh_frame+0xdf): undefined reference to `__gxx_personality_v0'

C:\SSCoin\src\leveldb\libleveldb.a(block.o):block.cc:(.text+0x16d): undefined reference to `_Unwind_Resume'

C:\SSCoin\src\leveldb\libleveldb.a(block.o):block.cc:(.text+0x187): undefined reference to `_Unwind_Resume'

C:\SSCoin\src\leveldb\libleveldb.a(block.o):block.cc:(.text$_ZN7leveldb5Block4Iter4SeekERKNS_5SliceE[leveldb::Block::Iter::Seek(leveldb::Slice const&)]+0x694): undefined reference to `_Unwind_Resume'

C:\SSCoin\src\leveldb\libleveldb.a(block.o):block.cc:(.text$_ZN7leveldb5Block4Iter10SeekToLastEv[leveldb::Block::Iter::SeekToLast()]+0x36f): undefined reference to `_Unwind_Resume'

C:\SSCoin\src\leveldb\libleveldb.a(block.o):block.cc:(.text$_ZN7leveldb5Block4Iter4NextEv[leveldb::Block::Iter::Next()]+0x2cf): undefined reference to `_Unwind_Resume'

C:\SSCoin\src\leveldb\libleveldb.a(block.o):block.cc:(.text$_ZN7leveldb5Block4Iter4PrevEv[leveldb::Block::Iter::Prev()]+0x3af): more undefined references to `_Unwind_Resume' follow

C:\SSCoin\src\leveldb\libleveldb.a(block.o):block.cc:(.eh_frame$_ZN7leveldb5Block4Iter4SeekERKNS_5SliceE+0x13): undefined reference to `__gxx_personality_v0'

C:\SSCoin\src\leveldb\libleveldb.a(block.o):block.cc:(.eh_frame$_ZN7leveldb5Block4Iter10SeekToLastEv+0x13): undefined reference to `__gxx_personality_v0'

C:\SSCoin\src\leveldb\libleveldb.a(block.o):block.cc:(.eh_frame$_ZN7leveldb5Block4Iter4NextEv+0x13): undefined reference to `__gxx_personality_v0'

C:\SSCoin\src\leveldb\libleveldb.a(block.o):block.cc:(.eh_frame$_ZN7leveldb5Block4Iter4PrevEv+0x13): undefined reference to `__gxx_personality_v0'

C:\SSCoin\src\leveldb\libleveldb.a(block.o):block.cc:(.eh_frame$_ZN7leveldb5Block4Iter11SeekToFirstEv+0x13): undefined reference to `__gxx_personality_v0'

C:\SSCoin\src\leveldb\libleveldb.a(block.o):block.cc:(.eh_frame+0x5f): more undefined references to `__gxx_personality_v0' follow

C:\SSCoin\src\leveldb\libmemenv.a(memenv.o):memenv.cc:(.text+0x7b2): undefined reference to `_Unwind_Resume'

C:\SSCoin\src\leveldb\libmemenv.a(memenv.o):memenv.cc:(.text+0x842): undefined reference to `_Unwind_Resume'

C:\SSCoin\src\leveldb\libmemenv.a(memenv.o):memenv.cc:(.text+0x8d2): undefined reference to `_Unwind_Resume'

C:\SSCoin\src\leveldb\libmemenv.a(memenv.o):memenv.cc:(.text+0xa6b): undefined reference to `_Unwind_Resume'

C:\SSCoin\src\leveldb\libmemenv.a(memenv.o):memenv.cc:(.text+0xb0b): undefined reference to `_Unwind_Resume'

C:\SSCoin\src\leveldb\libmemenv.a(memenv.o):memenv.cc:(.text+0xb9b): more undefined references to `_Unwind_Resume' follow

C:\SSCoin\src\leveldb\libmemenv.a(memenv.o):memenv.cc:(.eh_frame+0x37b): undefined reference to `__gxx_personality_v0'

c:\deps\db-4.8.30.NC\build_unix\libdb_cxx.a(cxx_env.o):cxx_env.cpp:(.text+0x8f6): undefined reference to `_Unwind_Resume'

c:\deps\db-4.8.30.NC\build_unix\libdb_cxx.a(cxx_env.o):cxx_env.cpp:(.text+0x916): undefined reference to `_Unwind_Resume'

c:\deps\db-4.8.30.NC\build_unix\libdb_cxx.a(cxx_env.o):cxx_env.cpp:(.text+0x936): undefined reference to `_Unwind_Resume'

c:\deps\db-4.8.30.NC\build_unix\libdb_cxx.a(cxx_env.o):cxx_env.cpp:(.text+0x956): undefined reference to `_Unwind_Resume'

c:\deps\db-4.8.30.NC\build_unix\libdb_cxx.a(cxx_env.o):cxx_env.cpp:(.text+0x976): undefined reference to `_Unwind_Resume'

c:\deps\db-4.8.30.NC\build_unix\libdb_cxx.a(cxx_env.o):cxx_env.cpp:(.text+0x19f2): more undefined references to `_Unwind_Resume' follow

c:\deps\db-4.8.30.NC\build_unix\libdb_cxx.a(cxx_env.o):cxx_env.cpp:(.eh_frame+0x463): undefined reference to `__gxx_personality_v0'

c:\deps\db-4.8.30.NC\build_unix\libdb_cxx.a(cxx_db.o):cxx_db.cpp:(.text+0xc83): undefined reference to `_Unwind_Resume'

c:\deps\db-4.8.30.NC\build_unix\libdb_cxx.a(cxx_db.o):cxx_db.cpp:(.text+0xc95): undefined reference to `_Unwind_Resume'

c:\deps\db-4.8.30.NC\build_unix\libdb_cxx.a(cxx_db.o):cxx_db.cpp:(.eh_frame+0x773): undefined reference to `__gxx_personality_v0'

c:\deps\db-4.8.30.NC\build_unix\libdb_cxx.a(cxx_except.o):cxx_except.cpp:(.text+0x1a8): undefined reference to `_Unwind_Resume'

c:\deps\db-4.8.30.NC\build_unix\libdb_cxx.a(cxx_except.o):cxx_except.cpp:(.text+0x38f): undefined reference to `_Unwind_Resume'

c:\deps\db-4.8.30.NC\build_unix\libdb_cxx.a(cxx_except.o):cxx_except.cpp:(.text+0x3df): undefined reference to `_Unwind_Resume'

c:\deps\db-4.8.30.NC\build_unix\libdb_cxx.a(cxx_except.o):cxx_except.cpp:(.text+0x42e): undefined reference to `_Unwind_Resume'

c:\deps\db-4.8.30.NC\build_unix\libdb_cxx.a(cxx_except.o):cxx_except.cpp:(.text+0x47d): undefined reference to `_Unwind_Resume'

c:\deps\db-4.8.30.NC\build_unix\libdb_cxx.a(cxx_except.o):cxx_except.cpp:(.text+0x65d): more undefined references to `_Unwind_Resume' follow

c:\deps\db-4.8.30.NC\build_unix\libdb_cxx.a(cxx_except.o):cxx_except.cpp:(.eh_frame+0x1eb): undefined reference to `__gxx_personality_v0'

collect2: ld returned 1 exit status

mingw32-make[1]: *** [debug\SSCoin-qt.exe] Error 1

mingw32-make[1]: Leaving directory `C:/build-sscoin-4_8-Debug'

mingw32-make: *** [debug] Error 2

12:45:38: Процесс «C:\MinGW\mingw32\bin\mingw32-make.exe» завершился с кодом 2.

Ошибка при сборке/установке проекта sscoin (комплект: 4.8)

Во время выполнения этапа «Сборка»

12:45:38: Прошло времени: 01:17.

 


  • 0

#111

Narasimha Rao
  • Narasimha Rao
  • New Member
  • MEMBER
  • Pip
  • 2 posts
  • 1 topics
    • Time Online: 2h 36m 2s
  • Country:Malaysia

C:\deps\boost_1_55_0>bootstrap.bat mingw
Building Boost.Build engine
'gcc' is not recognized as an internal or external command,
operable program or batch file.
 
Failed to build Boost.Build engine.
Please consult bootstrap.log for furter diagnostics.
 
You can try to obtain a prebuilt binary from
 
 
Also, you can file an issue at http://svn.boost.org
Please attach bootstrap.log in that case.

  • 0

#112

Bobby2234
  • Bobby2234
  • New Member
  • MEMBER
  • Pip
  • 4 posts
  • 2 topics
    • Time Online: 1h 7m 49s
  • Country:Canada

Hi, My command promot thats mingw doesnt work.

I mean it says unrecognized command


  • 0

#113

Bobby2234
  • Bobby2234
  • New Member
  • MEMBER
  • Pip
  • 4 posts
  • 2 topics
    • Time Online: 1h 7m 49s
  • Country:Canada

Hi, My command promot thats mingw doesnt work.

I mean it says unrecognized command


  • 1





Also tagged with one or more of these keywords: windows QT, build from source, cryptocurrency, mining, cryptocoin, cryptocoin development, cryptocurrency development, windows cryptocoin development, altcoin creation guide, altcoin wallet guide, building windows QT from source

0 user(s) are reading this topic

0 members, 0 guests, 0 anonymous users